(2-Chlorocyclohexyl)(2-chloroethyl) sulfide

Phase change data

Data compiled by: William E. Acree, Jr., James S. Chickos

Enthalpy of vaporization

ΔvapH (kJ/mol) Temperature (K) Method Reference Comment
62.5308.A,GSStephenson and Malanowski, 1987Based on data from 293. - 333. K. See also Redemann, Chaikin, et al., 1948 and Dykyj, Svoboda, et al., 1999.

References

Stephenson and Malanowski, 1987
Stephenson, Richard M.; Malanowski, Stanislaw, Handbook of the Thermodynamics of Organic Compounds, 1987, https://doi.org/10.1007/978-94-009-3173-2 . [all data]

Redemann, Chaikin, et al., 1948
Redemann, C. Ernst; Chaikin, Saul W.; Fearing, Ralph B., The Volatility and Vapor Pressure of Eight 2-Chloroethyl Alkyl (or Cycloalkyl) Sulfides 1, J. Am. Chem. Soc., 1948, 70, 2, 631-633, https://doi.org/10.1021/ja01182a059 . [all data]

Dykyj, Svoboda, et al., 1999
Dykyj, J.; Svoboda, J.; Wilhoit, R.C.; Frenkel, M.L.; Hall, K.R., Vapor Pressure of Chemicals: Part A. Vapor Pressure and Antoine Constants for Hydrocarbons and Sulfur, Selenium, Tellurium and Hydrogen Containing Organic Compounds, Springer, Berlin, 1999, 373. [all data]