m-Aminocinnamic acid

Condensed phase thermochemistry data

Data compiled by: Eugene S. Domalski and Elizabeth D. Hearing

Constant pressure heat capacity of solid

Cp,solid (cal/mol*K) Temperature (K) Reference Comment
54.40323.Satoh and Sogabe, 1941T = 0 to 100°C. Mean value

References

Satoh and Sogabe, 1941
Satoh, S.; Sogabe, T., The heat capacities of some organic compounds containing nitrogen and the atomic heat of nitrogen. (2), Sci., Pap. Inst. Phys. Chem. Res. (Tokyo), 1941, 38, 231-237. [all data]