Cyclopentane, 1-methyl-1-propyl-

Kovats' RI, non-polar column, isothermal

Data compiled by: NIST Mass Spectrometry Data Center, William E. Wallace, director

Column type PackedPackedPackedPackedCapillary
Active phase SqualaneSqualaneSqualaneSqualaneSqualane
Column length (m)     100.
Carrier gas
Substrate
Column diameter (mm)     0.25
Phase thickness (μm)
Temperature (C) 100.120.60.80.100.
I 893.899.884.889.894.
ReferenceBogoslovsky, Anvaer, et al., 1978Bogoslovsky, Anvaer, et al., 1978Bogoslovsky, Anvaer, et al., 1978Bogoslovsky, Anvaer, et al., 1978Dielmann, Schwengers, et al., 1974
Comment MSDC-RI MSDC-RI MSDC-RI MSDC-RI MSDC-RI
Column type CapillaryCapillaryCapillary
Active phase SqualaneSqualaneSqualane
Column length (m) 100.100.100.
Carrier gas
Substrate
Column diameter (mm) 0.250.250.25
Phase thickness (μm)
Temperature (C) 120.60.80.
I 899.884.889.
ReferenceDielmann, Schwengers, et al., 1974Dielmann, Schwengers, et al., 1974Dielmann, Schwengers, et al., 1974
Comment MSDC-RI MSDC-RI MSDC-RI

References

Bogoslovsky, Anvaer, et al., 1978
Bogoslovsky, Yu.N.; Anvaer, B.I.; Vigdergauz, M.S., Chromatographic constants in gas chromatography (in Russian), Standards Publ. House, Moscow, 1978, 192. [all data]

Dielmann, Schwengers, et al., 1974
Dielmann, G.; Schwengers, D.; Schomburg, G., Gas-chromatographische Retentionsdaten und Strukture chemischer Verbindungen Gesättigte und ungesättigte alkylsubstituierte Cyclopentane und Methylcyclopentane, Chromatographia, 1974, 7, 5, 215-224, https://doi.org/10.1007/BF02321771 . [all data]