Methyl 2-(methylthio)acetate

Van Den Dool and Kratz RI, polar column, temperature ramp

Data compiled by: NIST Mass Spectrometry Data Center, William E. Wallace, director

Column type CapillaryCapillaryCapillary
Active phase DB-Wax EtrDB-WaxAT-Wax
Column length (m) 30.30.60.
Carrier gas HeH2He
Substrate
Column diameter (mm) 0.250.250.32
Phase thickness (μm) 0.250.250.25
Tstart (C) 40.40.65.
Tend (C) 250.250.250.
Heat rate (K/min) 5.3.2.
Initial hold (min) 3.3.10.
Final hold (min) 15.20.60.
I 1412.1402.1395.
ReferenceAubert C. and Pitrat M., 2006Aubert and Bourger, 2004Pino, Almora, et al., 2003
Comment MSDC-RI MSDC-RI MSDC-RI

References

Aubert C. and Pitrat M., 2006
Aubert C.; Pitrat M., Volatile compounds in the skin and pulp of Queen Anne's pocket melon, J. Agric. Food Chem., 2006, 54, 21, 8177-8182, https://doi.org/10.1021/jf061415s . [all data]

Aubert and Bourger, 2004
Aubert, C.; Bourger, N., Investigation of volatiles in charentais cantaloupe melons (Cucumis melo Var. cantalupensis). Characterization of aroma constituents in some cultivars, J. Agric. Food Chem., 2004, 52, 14, 4522-4528, https://doi.org/10.1021/jf049777s . [all data]

Pino, Almora, et al., 2003
Pino, J.; Almora, K.; Marbot, R., Volatile components of papaya (Carica papaya L., maradol variety) fruit, Flavour Fragr. J., 2003, 18, 6, 492-496, https://doi.org/10.1002/ffj.1248 . [all data]