Dibenzothiophene, 3-methyl-

Lee's RI, non-polar column, temperature ramp

Data compiled by: NIST Mass Spectrometry Data Center, William E. Wallace, director

Column type CapillaryCapillaryCapillaryCapillaryCapillary
Active phase Rxi-5 MSDB-5MSDB-5MSHP-5HP-5
Column length (m) 30.30.30.60.60.
Carrier gas Helium HeHeHe
Substrate
Column diameter (mm) 0.250.250.250.250.25
Phase thickness (μm) 0.250.250.250.250.25
Tstart (C) 60.50.60.35.35.
Tend (C) 340.300.300.300.300.
Heat rate (K/min) 5.6.10.3.3.
Initial hold (min) 1.2.1.
Final hold (min) 0.16.
I 315.68315.17315.51313.83313.83
ReferenceZeigler, Schantz, et al., 2012Sun, Zhou, et al., 2008Schade and Andersson, 2006Marynowski, Pieta, et al., 2004Marynowski, Pieta, et al., 2004
Comment MSDC-RI MSDC-RI MSDC-RI MSDC-RI MSDC-RI
Column type CapillaryCapillaryCapillaryCapillaryCapillary
Active phase HP-5MSDB-5DB-5SE-30CP Sil 8 CB
Column length (m) 30.30.30.25.50.
Carrier gas  HeHeNitrogenHe
Substrate
Column diameter (mm) 0.250.250.320.200.25
Phase thickness (μm) 0.250.250.25 0.25
Tstart (C) 65.110.50.80.80.
Tend (C) 290.325.300.290.300.
Heat rate (K/min) 3.10.6.4.4.
Initial hold (min) 5.1.2.
Final hold (min) 20.5.
I 315.43315.1315.57316.72315.7
ReferenceZhou, Wang, et al., 2004Becker and Colmsjö, 1998Wang, Fingas, et al., 1994Wang, Xue, et al., 1994Bundt, Herbel, et al., 1991
Comment MSDC-RI MSDC-RI MSDC-RI MSDC-RI MSDC-RI
Column type CapillaryCapillaryCapillary
Active phase DB-5OV-73SE-52
Column length (m) 30.68.20.
Carrier gas   H2
Substrate
Column diameter (mm) 0.320.280.30
Phase thickness (μm)  0.150.25
Tstart (C) 80. 40.
Tend (C) 300. 265.
Heat rate (K/min) 3.51.54.
Initial hold (min) 1. 2.
Final hold (min) 10.
I 316.2315.8316.32
ReferencePalmentier, Britten, et al., 1989Arpino, Ignatiadis, et al., 1987Vassilaros, Kong, et al., 1982
Comment MSDC-RI MSDC-RI MSDC-RI

Normal alkane RI, non-polar column, custom temperature program

Data compiled by: NIST Mass Spectrometry Data Center, William E. Wallace, director

Column type Capillary
Active phase RTX-5 MS
Column length (m) 15.
Carrier gas Helium
Substrate
Column diameter (mm) 0.25
Phase thickness (μm) 0.25
Program 35 0C (6 min) 5 0C/min -> 150 0C 10 0C/min -> 280 0C (3 min)
I 1862.
ReferenceNadaf, Halimi, et al., 2012
Comment MSDC-RI

References

Zeigler, Schantz, et al., 2012
Zeigler, C.; Schantz, M.; Wise, S.; Robbat, A., Mass spectra and retention indices for polycyclic aromatic sulfur heterocycles and some alkylated analogs, Polycyclic Aromatic Compounds, 2012, 32, 2, 154-176, https://doi.org/10.1080/10406638.2011.651679 . [all data]

Sun, Zhou, et al., 2008
Sun, P.; Zhou, Q.; Li, G.; Wang, X.; Zhao, Y.; Cao, L., fingerprint analysis of polycyclic aromatic hydrocarbons in crude oil by internal standard method, J. Instrumental Anal., 2008, 27, 4, 344-348. [all data]

Schade and Andersson, 2006
Schade, T.; Andersson, J.T., Speciation of alkylated dibenzothiophenes through correlation of structure and gas chromatographic retention indexes, J. Chromatogr. A, 2006, 1117, 2, 206-213, https://doi.org/10.1016/j.chroma.2006.03.079 . [all data]

Marynowski, Pieta, et al., 2004
Marynowski, L.; Pieta, M.; Janeczek, J., Composition and source of polycyclic aromatic compounds in deposited dust from selected sites around the Upper Silesia, Poland, Geol. Q., 2004, 48, 2, 169-180. [all data]

Zhou, Wang, et al., 2004
Zhou, J.; Wang, T.; Shi, Q.; Huang, Y.; Mao, T.; Zhong, N.; Zhang, Y.; Zhang, X., Determination of sulfur and oxygen containing polycyclic aromatic hydrocarbons in inhalable particulate by gas chromatography - mass spectrometry, J. Chin. Mass Spectrom. Soc., 2004, 25, 3, 134-140. [all data]

Becker and Colmsjö, 1998
Becker, G.; Colmsjö, A., Gas chromatography-atomic emission detection for quantification of polycyclic aromatic sulfur heterocycles, Anal. Chim. Acta., 1998, 376, 3, 265-272, https://doi.org/10.1016/S0003-2670(98)00546-7 . [all data]

Wang, Fingas, et al., 1994
Wang, Z.; Fingas, M.; Li, K., Fractionation of a light crude oil and identification and quantitation of aliphatic, aromatic, and biomarker comopunds by GC-FID and GC-MS, Part II, J. Chromatogr. Sci., 1994, 32, 9, 367-382, https://doi.org/10.1093/chromsci/32.9.367 . [all data]

Wang, Xue, et al., 1994
Wang, X.; Xue, W.; Zhu, J.; Gu, Y.; Sheng, G.; Fu, J., Characterization of polynuclear aromatic sulfur heterocycles in a coal, J. Fuel Chemistry and Technology, 1994, 22, 2, 196-202. [all data]

Bundt, Herbel, et al., 1991
Bundt, J.; Herbel, W.; Steinhart, H.; Franke, S.; Francke, W., Structure-type separation of diesel fuels by solid phase extraction and identification of the two- and three-ring aromatics by capillary GC-mass spectrometry, J. Hi. Res. Chromatogr., 1991, 14, 2, 91-98, https://doi.org/10.1002/jhrc.1240140205 . [all data]

Palmentier, Britten, et al., 1989
Palmentier, J.-P.F.; Britten, A.J.; Charbonneau, G.M.; Karasek, F.W., Determination of polycyclic aromatic hydrocarbons in lubricating oil base stocks using high-performance liquid chromatography and gas chromatography-mass spectrometry, J. Chromatogr., 1989, 469, 241-251, https://doi.org/10.1016/S0021-9673(01)96459-3 . [all data]

Arpino, Ignatiadis, et al., 1987
Arpino, P.J.; Ignatiadis, I.; de Rycke, G., Sulphur-containing polynuclear aromatic hydrocarbons from petroleum. Examination of their possible statistical formation in sediments, J. Chromatogr., 1987, 390, 2, 329-348, https://doi.org/10.1016/S0021-9673(01)94385-7 . [all data]

Vassilaros, Kong, et al., 1982
Vassilaros, D.L.; Kong, R.C.; Later, D.W.; Lee, M.L., Linear retention index system for polycyclic aromatic compounds. Critical evaluation and additional indices, J. Chromatogr., 1982, 252, 1-20, https://doi.org/10.1016/S0021-9673(01)88394-1 . [all data]