Naphtho[2,3-b]thiophene, 4,9-dimethyl-

Normal alkane RI, non-polar column, temperature ramp

Data compiled by: NIST Mass Spectrometry Data Center, William E. Wallace, director

Column type Capillary
Active phase HP-5
Column length (m) 30.
Carrier gas He
Substrate
Column diameter (mm) 0.32
Phase thickness (μm) 0.25
Tstart (C) 60.
Tend (C) 260.
Heat rate (K/min) 5.
Initial hold (min) 2.
Final hold (min) 14.
I 1991.
ReferenceYayli, Gülec, et al., 2006
Comment MSDC-RI

References

Yayli, Gülec, et al., 2006
Yayli, N.; Gülec, C.; Ücüncü, O.; Yasar, A.; Ülker, S.; Coskuncelebi, K.; Terzioglu, S., Composition and Antimicrobial Activities of Volatile Components of Minuartia meyeri, Turk. J. Chem., 2006, 30, 71-76. [all data]