1-Propanone, 1-(1-cyclohexen-1-yl)-

Normal alkane RI, polar column, temperature ramp

View large format table.

Column type Active phase I Reference Comment
CapillaryCarbowax 20M1620.Seifert and King, 1982He, 50. C @ 10. min, 1. K/min, 170. C @ 60. min; Column length: 150. m; Column diameter: 0.64 mm

References

Seifert and King, 1982
Seifert, R.M.; King, A.D., Jr., Identification of some volatile constituents of Aspergillus clavatus, J. Agric. Food Chem., 1982, 30, 4, 786-790, https://doi.org/10.1021/jf00112a044 . [all data]