Cyclopropanol

Gas phase thermochemistry data

Data compiled by: Glushko Thermocenter, Russian Academy of Sciences, Moscow

Constant pressure heat capacity of gas

Cp,gas (J/mol*K) Temperature (K) Reference Comment
33.550.Thermodynamics Research Center, 1997p=1 bar.
37.8100.
44.9150.
53.5200.
69.3273.15
75.2298.15
75.7300.
98.7400.
117.9500.
133.1600.
145.1700.
155.0800.
163.3900.
170.41000.
176.51100.
181.91200.
186.51300.
190.61400.
194.11500.

References

Thermodynamics Research Center, 1997
Thermodynamics Research Center, Selected Values of Properties of Chemical Compounds., Thermodynamics Research Center, Texas A&M University, College Station, Texas, 1997. [all data]