2-Tridecanol

Kovats' RI, polar column, isothermal

Data compiled by: NIST Mass Spectrometry Data Center, William E. Wallace, director

Column type PackedPacked
Active phase Carbowax 20MCarbowax 20M
Column length (m) 2.552.55
Carrier gas
Substrate
Column diameter (mm)
Phase thickness (μm)
Temperature (C) 130.165.
I 1903.1906.
ReferenceSingliar, 1972Singliar, 1972
Comment MSDC-RI MSDC-RI

References

Singliar, 1972
Singliar, M., Chromatographic Behaviour and the Structure of Secondary Aliphatic Alcohols, J. Chromatogr., 1972, 65, 1, 311-321, https://doi.org/10.1016/S0021-9673(00)86946-0 . [all data]