Acetonitrile, 2-(3-cyanophenyl)-

Reaction thermochemistry data

Data compiled by: John E. Bartmess

Individual Reactions

C9H5N2- + Hydrogen cation = Acetonitrile, 2-(3-cyanophenyl)-

By formula: C9H5N2- + H+ = C9H6N2

Quantity Value Units Method Reference Comment
Δr339.2 ± 2.3kcal/molG+TSFujio, McIver, et al., 1981gas phase; value altered from reference due to change in acidity scale
Quantity Value Units Method Reference Comment
Δr332.2 ± 2.0kcal/molIMREFujio, McIver, et al., 1981gas phase; value altered from reference due to change in acidity scale

Gas phase ion energetics data

Data compiled by: John E. Bartmess

De-protonation reactions

C9H5N2- + Hydrogen cation = Acetonitrile, 2-(3-cyanophenyl)-

By formula: C9H5N2- + H+ = C9H6N2

Quantity Value Units Method Reference Comment
Δr339.2 ± 2.3kcal/molG+TSFujio, McIver, et al., 1981gas phase; value altered from reference due to change in acidity scale
Quantity Value Units Method Reference Comment
Δr332.2 ± 2.0kcal/molIMREFujio, McIver, et al., 1981gas phase; value altered from reference due to change in acidity scale

References

Fujio, McIver, et al., 1981
Fujio, M.; McIver, R.T., Jr.; Taft, R.W., Effects on the acidities of phenols from specific substituent-solvent interactions. Inherent substituent parameters from gas phase acidities, J. Am. Chem. Soc., 1981, 103, 4017. [all data]