1,4-Dihydro-1,4-methanonaphthalene-6-carbonitrile

Gas phase ion energetics data

Data compiled as indicated in comments:
LLK - Sharon G. Lias, Rhoda D. Levin, and Sherif A. Kafafi

Ionization energy determinations

IE (eV) Method Reference Comment
8.85 ± 0.05PEPaguette, Ku, et al., 1979Vertical value; LLK
8.87 ± 0.05PESantiago, McAlduff, et al., 1978Vertical value; LLK

References

Paguette, Ku, et al., 1979
Paguette, L.A.; Ku, A.Y.; Santiago, C.; Rozenboom, M.D.; Houk, K.N., Control of regioselectivity in the di-π-methane rearrangement. Triplet-sensitized photoisomerization of benzonorbornadienes carrying cyano substituents in the aryl and vinyl segments, J. Am. Chem. Soc., 1979, 101, 5972. [all data]

Santiago, McAlduff, et al., 1978
Santiago, C.; McAlduff, E.J.; Houk, K.N.; Snow, R.A.; Paquette, L.A., Photoelectron spectra of ortho- and meta-substituted benzonorbornadienes. Relationships to regioselectivities in triplet di-π-methane rearrangements, J. Am. Chem. Soc., 1978, 100, 6149. [all data]