Cyclohexanone,cis-2-chloro-4-(1,1-dimethylethyl)-

Gas phase ion energetics data

Data compiled by: Sharon G. Lias, Rhoda D. Levin, and Sherif A. Kafafi

Ionization energy determinations

IE (eV) Method Reference
9.48PELoudet, Grimaud, et al., 1976

References

Loudet, Grimaud, et al., 1976
Loudet, M.; Grimaud, M.; Metras, F.; Pfister-Guillouzo, G., Interactions intramoleculaires en serie cyclohexanique partie II. Spectres photoelectroniques de chloro-2-cyclohexanones, J. Mol. Struct., 1976, 35, 213. [all data]