1,4-Benzodioxin, 2,3-dihydro-6-nitro-

Phase change data

Data compiled by: William E. Acree, Jr., James S. Chickos

Quantity Value Units Method Reference Comment
Δsub24.04 ± 0.29kcal/molCMatos, Sousa, et al., 2008

Enthalpy of fusion

ΔfusH (kcal/mol) Temperature (K) Method Reference
5.801394.DSCMatos, Sousa, et al., 2008

References

Matos, Sousa, et al., 2008
Matos, M. Agostinha R.; Sousa, Clara C.S.; Morais, Victor M.F., Experimental and Computational Thermochemistry of 1,4-Benzodioxan and its 6-R Derivatives, J. Phys. Chem. A, 2008, 112, 34, 7961-7968, https://doi.org/10.1021/jp803579y . [all data]