Decanoic acid tert-butyl ester

Condensed phase thermochemistry data

Data compiled by: Hussein Y. Afeefy, Joel F. Liebman, and Stephen E. Stein

Quantity Value Units Method Reference Comment
Δcliquid-8757.9 ± 7.9kJ/molCcbSwain, Silbert, et al., 1964Corresponding Δfliquid = -752.7 kJ/mol (simple calculation by NIST; no Washburn corrections)

References

Swain, Silbert, et al., 1964
Swain, H.A., Jr.; Silbert, L.S.; Miller, J.G., The heats of combustion of aliphatic long chain peroxyacids, t-butyl peroxyesters, and related acids and esters, J. Am. Chem. Soc., 1964, 86, 2562-2566. [all data]