Iron, tricarbonylbis(phosphorus trifluoride)-

Gas phase ion energetics data

Data compiled by: Sharon G. Lias, Rhoda D. Levin, and Sherif A. Kafafi

Ionization energy determinations

IE (eV) Method Reference Comment
8.47EIMuller, Fenderl, et al., 1971
8.95PEHead, Nixon, et al., 1978Vertical value

References

Muller, Fenderl, et al., 1971
Muller, J.; Fenderl, K.; Mertschenk, B., Die Donor-Akzeptor-Eigenschaften des Liganden Trifluorphosphin in Ubergangsmetallkomplexen, Chem. Ber., 1971, 104, 700. [all data]

Head, Nixon, et al., 1978
Head, R.A.; Nixon, J.F.; Westwood, N.P.C.; Clark, R.J., He(I) photoelectron spectra of mixed carbonyltrifluorophosphine complexes of zero-valent iron, J. Organomet. Chem., 1978, 145, 75. [all data]