Pentafluoroethoxybenzene

Gas phase ion energetics data

Data compiled by: Henry M. Rosenstock, Keith Draxl, Bruce W. Steiner, and John T. Herron

Ionization energy determinations

IE (eV) Method Reference Comment
9.97PEBaker, May, et al., 1968Vertical value

References

Baker, May, et al., 1968
Baker, A.D.; May, D.P.; Turner, D.W., Molecular photoelectron spectroscopy. Part VII. The vertical ionisation potentials of benzene and some of its monosubstituted and 1,4-disubstituted derivatives, J. Chem. Soc. B, 1968, 22. [all data]