2H-Pyran-2-one, 5,6-dihydro-6-propyl-

Van Den Dool and Kratz RI, non-polar column, custom temperature program

View large format table.

Column type Active phase I Reference Comment
CapillaryHP-5MS1267.5Andriamaharavo, 201430. m/0.25 mm/0.25 μm, He; Program: 60C (1 min) => 5 C/min => 210C => 10 C/min => 280C (15 min)

Normal alkane RI, non-polar column, custom temperature program

View large format table.

Column type Active phase I Reference Comment
CapillarySE-541260.Frauendorfer and Schieberle, 2008Helium; Program: not specified

Normal alkane RI, polar column, custom temperature program

View large format table.

Column type Active phase I Reference Comment
CapillaryFFAP2005.Frauendorfer and Schieberle, 2008Helium; Program: not specified

References

Andriamaharavo, 2014
Andriamaharavo, N.R., Retention Data. NIST Mass Spectrometry Data Center., NIST Mass Spectrometry Data Center, 2014. [all data]

Frauendorfer and Schieberle, 2008
Frauendorfer, F.; Schieberle, P., Changes in key aroma compounds of criollo cocoa beans during roasting, J. Agric. Food Chem., 2008, 56, 21, 10244-10251, https://doi.org/10.1021/jf802098f . [all data]