7,7-Dihexyltridecane

Phase change data

Data compiled by: William E. Acree, Jr., James S. Chickos

Quantity Value Units Method Reference Comment
Δvap27.56 ± 0.43kcal/molCGCChickos, Hesse, et al., 1995

References

Chickos, Hesse, et al., 1995
Chickos, James S.; Hesse, Donald G.; Hosseini, Sarah; Liebman, Joel F.; David Mendenhall, G.; Verevkin, Sergej P.; Rakus, Klaus; Beckhaus, Hans-Dieter; Rüchardt, Christoph, Enthalpies of vaporization of some highly branched hydrocarbons, The Journal of Chemical Thermodynamics, 1995, 27, 6, 693-705, https://doi.org/10.1006/jcht.1995.0071 . [all data]