1,3,5-Undecatriene

Normal alkane RI, polar column, temperature ramp

Data compiled by: NIST Mass Spectrometry Data Center, William E. Wallace, director

Column type Capillary
Active phase Supelcowax-10
Column length (m) 30.
Carrier gas
Substrate
Column diameter (mm) 0.25
Phase thickness (μm) 0.25
Tstart (C) 40.
Tend (C) 210.
Heat rate (K/min) 2.
Initial hold (min) 2.
Final hold (min) 33.
I 1399.
ReferenceGarneau F.X., Collin G., et al., 2006
Comment MSDC-RI

References

Garneau F.X., Collin G., et al., 2006
Garneau F.X.; Collin G.; Gagnon H.; Jean F.I.; Strobl H.; Pichette A., The essential oil composition of Devil's Club, Oplopanax horridus J. E. Smith Miq., Flavour Fragr. J., 2006, 21, 5, 792-794, https://doi.org/10.1002/ffj.1716 . [all data]