1-Hexanol, 6-mercapto-

Normal alkane RI, non-polar column, custom temperature program

View large format table.

Column type Active phase I Reference Comment
CapillaryCP Sil 5 CB1176.Vermeulen and Collin, 200650. m/0.32 mm/1.2 μm; Program: 40 0C (4 min) 2 0C/min -> 132 0C 10 0C/min -> 250 0C (15 min)

Normal alkane RI, polar column, custom temperature program

View large format table.

Column type Active phase I Reference Comment
CapillaryFFAP2100.Gros, Nizet, et al., 201125. m/0.32 mm/0.30 μm, Nitrogen; Program: 36 0C 20 0C/min -> 85 0C 1 0C/min -> 145 0C 3 0C/min -> 250 0C (30 min)
CapillaryCP-Wax 58CB2084.Vermeulen and Collin, 200625. m/0.32 mm/0.30 μm; Program: 40 0C (4 min) 2 0C/min -> 132 0C 10 0C/min -> 250 0C (15 min)

References

Vermeulen and Collin, 2006
Vermeulen, C.; Collin, S., Combinatorial Synthesis and Screening of Nover Odorants such as Polyfunctional Thiols, Combinatorial Chem. High Throghput Screening, 2006, 9, 8, 583-590, https://doi.org/10.2174/138620706778249712 . [all data]

Gros, Nizet, et al., 2011
Gros, J.; Nizet, S.; Collin, S., Occurence of odorant polyfunctional thiols in the Super Alpha Tomahawk Hop cultivar. Comparison with the thiol-rich Nelson Sauvin bitter variety, J. Agric. Food Chem., 2011, 59, 16, 8853-8865, https://doi.org/10.1021/jf201294e . [all data]