2H-Imidazo[4,5-b]pyridin-2-one, 1,3-dihydro-

Kovats' RI, non-polar column, temperature ramp

View large format table.

Column type Active phase I Reference Comment
CapillaryDB-51740.Ramarathnam, Rubin, et al., 1993He, 30. C @ 2. min, 10. K/min, 280. C @ 3. min; Column length: 30. m; Column diameter: 0.13 mm
CapillaryDB-51740.Ramarathnam, Rubin, et al., 1993, 2He, 30. C @ 2. min, 10. K/min, 280. C @ 3. min; Column length: 30. m; Column diameter: 0.13 mm

References

Ramarathnam, Rubin, et al., 1993
Ramarathnam, N.; Rubin, L.J.; Diosady, L.L., Studies on meat flavor. 3. A novel method for trapping volatile components from uncured and cured pork, J. Agric. Food Chem., 1993, 41, 6, 933-938, https://doi.org/10.1021/jf00030a019 . [all data]

Ramarathnam, Rubin, et al., 1993, 2
Ramarathnam, N.; Rubin, L.J.; Diosady, L.L., Studies on meat flavor. 4. Fractionation, characterization, and quantitation of volatiles from uncured and cured beef and chicken, J. Agric. Food Chem., 1993, 41, 6, 939-945, https://doi.org/10.1021/jf00030a020 . [all data]