Exo-2-methyl-7-oxabi-cyclo[2.2.1]heptane

Condensed phase thermochemistry data

Data compiled by: Hussein Y. Afeefy, Joel F. Liebman, and Stephen E. Stein

Quantity Value Units Method Reference Comment
Δfliquid-253.8 ± 2.2kJ/molCcbBedford, Beezer, et al., 1963
Quantity Value Units Method Reference Comment
Δcliquid-4215.7 ± 1.7kJ/molCcrAndruzzi, Pilcher, et al., 1977Corresponding Δfliquid = -253.9 kJ/mol (simple calculation by NIST; no Washburn corrections)
Δcliquid-4215.7 ± 1.7kJ/molCcbBedford, Beezer, et al., 1963Corresponding Δfliquid = -253.8 kJ/mol (simple calculation by NIST; no Washburn corrections)

References

Bedford, Beezer, et al., 1963
Bedford, A.F.; Beezer, A.E.; Mortimer, C.T.; Springall, H.D., Heats of combustion and molecular structure. Part IX. Bicylo[2,2,1]heptane, 7-oxabicyclo[2,2,1]heptane, and exo- and endo-2-methyl-7-oxabicyclo[2,2,1]heptane, J. Chem. Soc., 1963, 3823-3828. [all data]

Andruzzi, Pilcher, et al., 1977
Andruzzi, F.; Pilcher, G.; Virmani, Y.; Plesch, P.H., Enthalpy of polymerization of 7-oxabicyclo[2.2.1]heptane, and exo- and endo-2-methyl-7-oxabicyclo[2.2.1]heptane, Makromol. Chem., 1977, 178, 2367-2373. [all data]