1-Penten-3-one

Normal alkane RI, polar column, custom temperature program

Data compiled by: NIST Mass Spectrometry Data Center, William E. Wallace, director

Column type CapillaryCapillaryCapillaryCapillaryCapillary
Active phase SOLGel-WaxSOLGel-WaxDB-WaxSupelko CO WaxSupelko CO Wax
Column length (m) 30.30.60.60.60.
Carrier gas HeliumHeliumHeliumHeliumHelium
Substrate
Column diameter (mm) 0.250.250.250.320.32
Phase thickness (μm) 0.250.250.500.250.25
Program 40 0C (2 min) 5 0C/min -> 140 0C 10 0C/min -> 250 0C (3 min)not specified40 0C 4 0C/min -> 230 0C 100 0C/min -> 260 0C (11.7 min)40 0C (5 min) 4 0C/min -> 75 0C 5 0C/min -> 250 0C (10 min)not specified
I 1024.1024.1057.1008.1016.
ReferenceJohanningsmeier and McFeeters, 2011Johanningsmeier and McFeeters, 2011Miyazaki, Plotto, et al., 2011Vekiari, Orepoulou, et al., 2010Vekiari, Orepoulou, et al., 2010
Comment MSDC-RI MSDC-RI MSDC-RI MSDC-RI MSDC-RI
Column type CapillaryCapillaryCapillaryCapillaryCapillary
Active phase CP-Wax 52 CBHP-FFAPHP-InnowaxHP-InnowaxHP-Innowax
Column length (m) 60.30.30.30.30.
Carrier gas Helium HeliumHeHe
Substrate
Column diameter (mm) 0.250.320.250.250.25
Phase thickness (μm) 0.250.250.250.250.25
Program 45 0C (5 min) 3 0C/min -> 150 0C 10 0C/min -> 240 0C35 0C (10 min) 10 0C/min -> 150 0C 20 0C/min -> 250 0C (10 min)30 0C (5 min) 5 0C/min -> 100 0C (5 min) 1 0C/min -> 130 0C 10 0C/min -> 195 0C (45 min)30C(5min) => 7C/min => 100C(5min) => 1C/min => 130C => 10C/min => 195C(45min)30C(5min) => 7C/min => 100C(5min) => 1C/min => 130C => 10C/min => 195C(45min)
I 1024.1034.1014.1015.1017.
ReferenceRomeo, Verzera, et al., 2009Carrapiso and Garsia, 2007Narain, Galvao, et al., 2007Narain, Galvao, et al., 2007, 2Narain, Galvao, et al., 2007, 2
Comment MSDC-RI MSDC-RI MSDC-RI MSDC-RI MSDC-RI
Column type CapillaryCapillaryCapillaryCapillaryCapillary
Active phase Carbowax 20MDB-WaxDB-WaxDB-WaxFFAP
Column length (m) 50.60.60.30.25.
Carrier gas H2HeliumHeHe
Substrate
Column diameter (mm) 0.320.250.320.320.32
Phase thickness (μm) 0.50.250.50.50.3
Program 25C(7min) => 0.8C/min => 33C => 2.4C/min => 80C => 3.7C/min => 155C (20min)60 0C (3 min) 2 0C/min -> 150 0C 4 0C/min -> 200 0C50C(6min) => 1C/min => 130C => 10C/min => 240C (15min)50C(5min) => 1C/min => 80C => 10C/min => 250C35C (2min) => 40C/min => 60C(1min) => 6C/min => 230C
I 1018.1016.1026.1018.1015.
ReferenceDhifi, Angerosa, et al., 2005Kim. J.H., Ahn, et al., 2004Piveteau, le Guen, et al., 2000Piveteau, le Guen, et al., 2000Reiners and Grosch, 1998
Comment MSDC-RI MSDC-RI MSDC-RI MSDC-RI MSDC-RI
Column type CapillaryCapillaryCapillaryCapillaryCapillary
Active phase Supelcowax 10Supelcowax 10CP-Wax 52CBCP-Wax 52CBCP-Wax 52CB
Column length (m) 60.60. 50.50.
Carrier gas HeliumHelium
Substrate
Column diameter (mm) 0.250.25 0.320.32
Phase thickness (μm) 0.250.25 1.51.5
Program 60 0C (10 min) 2 0C/min -> 80 0C 3 0C/min -> 100 0C 4 0C/min -> 220 0C (30 min)not specified40C => 2C/min => 150C => 10C/min => 250C40C => 2C/min => 150C => 10C/min => 250C40C => 2C/min => 150C => 10C/min => 250C
I 1017.1025.1008.1009.1009.
ReferenceCastioni and Kapetanidis, 1996Castioni and Kapetanidis, 1996Luning, Carey, et al., 1995Luning, de Rijk, et al., 1994Luning, de Rijk, et al., 1994
Comment MSDC-RI MSDC-RI MSDC-RI MSDC-RI MSDC-RI
Column type Capillary
Active phase DB-Wax
Column length (m) 60.
Carrier gas
Substrate
Column diameter (mm) 0.32
Phase thickness (μm)
Program not specified
I 1018.
ReferenceBinder, Flath, et al., 1989
Comment MSDC-RI

Van Den Dool and Kratz RI, non-polar column, temperature ramp

Data compiled by: NIST Mass Spectrometry Data Center, William E. Wallace, director

Column type CapillaryCapillaryCapillaryCapillaryCapillary
Active phase DB-5MSDB-5Mega 5MSSPB-5HP-5MS
Column length (m) 30.30.60.60.30.
Carrier gas He HeHeHe
Substrate
Column diameter (mm) 0.250.250.250.320.25
Phase thickness (μm) 0.251.0.251.0.25
Tstart (C) 35.50.60.40.60.
Tend (C) 225.290.240.230.250.
Heat rate (K/min) 10.10.3.3.4.
Initial hold (min) 5.1. 5.2.
Final hold (min) 25.10. 5.20.
I 683.687.650.683.678.
ReferenceLozano P.R., Drake M., et al., 2007Bylaite and Meyer, 2006Condurso, Verzera, et al., 2006Deport, Ratel, et al., 2006Pino, Mesa, et al., 2005
Comment MSDC-RI MSDC-RI MSDC-RI MSDC-RI MSDC-RI
Column type CapillaryCapillaryCapillaryCapillaryCapillary
Active phase DB-5MSDB-5MSHP-1CP Sil 8 CBSE-30
Column length (m) 30.30.50.60.50.
Carrier gas HeHeHeHe
Substrate
Column diameter (mm) 0.250.250.20.250.32
Phase thickness (μm) 0.250.250.330.250.25
Tstart (C) 40.40.60.40.50.
Tend (C) 200.200.250.280.250.
Heat rate (K/min) 4.4.2.4.4.
Initial hold (min) 5.5.5.2.
Final hold (min) 20.20.20.
I 676.680.657.691.709.
ReferenceYu, Kim, et al., 2004Yu, Kim, et al., 2004Cavalli, Fernandez, et al., 2003Elmore, Campo, et al., 2002Misharina and Golovnya, 1996
Comment MSDC-RI MSDC-RI MSDC-RI MSDC-RI MSDC-RI

Phase change data

Data compiled as indicated in comments:
BS - Robert L. Brown and Stephen E. Stein
AC - William E. Acree, Jr., James S. Chickos

Reduced pressure boiling point

Tboil (K) Pressure (atm) Reference Comment
311.20.079Aldrich Chemical Company Inc., 1990BS
375.20.974Weast and Grasselli, 1989BS
317.20.12Weast and Grasselli, 1989BS

Enthalpy of vaporization

ΔvapH (kcal/mol) Temperature (K) Method Reference Comment
8.77318.AStephenson and Malanowski, 1987Based on data from 303. - 376. K.; AC

Gas phase ion energetics data

Data compiled as indicated in comments:
LLK - Sharon G. Lias, Rhoda D. Levin, and Sherif A. Kafafi

Quantity Value Units Method Reference Comment
Δf(+) ion185.kcal/molN/AN/A

Ionization energy determinations

IE (eV) Method Reference Comment
9.50PEMasclet and Mouvier, 1978LLK

Kovats' RI, non-polar column, temperature ramp

View large format table.

Column type Active phase I Reference Comment
CapillaryBP-1650.Bartley and Schwede, 1989He, 30. C @ 2. min, 2. K/min; Column length: 50. m; Column diameter: 0.23 mm; Tend: 200. C

Van Den Dool and Kratz RI, non-polar column, custom temperature program

View large format table.

Column type Active phase I Reference Comment
CapillaryDB-5680.Klesk and Qian, 200330. m/0.32 mm/1. μm, He; Program: 40C(2min) => 2C/min => 100C => 10C/min => 230C (5min)
CapillaryHP-5678.Carrapiso, Jurado, et al., 200250. m/0.32 mm/1.05 μm; Program: 35C (5min) => 10C/min => 150C => 20C/min => 250C (10min)
CapillaryHP-5678.Carrapiso, Ventanas, et al., 200250. m/0.32 mm/1.05 μm; Program: 35C(5min) => 10C/min => 150C => 20C/min => 250C(10 min)
CapillaryHP-5684.Engel, Baty, et al., 200230. m/0.25 mm/0.25 μm, He; Program: 5C(5min) => 3C/min => 20C => 5C/min => 100C 15C/min => 150C (5min)
CapillarySE-54683.Buettner and Schieberle, 199930. m/0.32 mm/0.25 μm, He; Program: 35C (2min) => 40C/min => 50C (2min) => 6C/min => 180C => 10C/min => 230C (10min)
CapillarySE-54683.Hinterholzer, Lemos, et al., 199830. m/0.32 mm/0.25 μm, He; Program: 35C(2min) => 40C/min => 50C(2min) => 6C/min => 180C => 10C/min => 230C(10 min)
CapillarySE-54683.Hinterholzer and Schieberie, 199830. m/0.32 mm/0.25 μm, He; Program: 35C(2min) => 40C/min => 50C(2min) => 6C/min => 180C => 10C/min => 230C(10min)
CapillarySE-54680.Ullrich and Grosch, 1988Program: not specified

Van Den Dool and Kratz RI, polar column, temperature ramp

View large format table.

Column type Active phase I Reference Comment
CapillaryHP-Innowax1020.Hashizume M., Gordon M.H., et al., 200760. m/0.25 mm/0.25 μm, 40. C @ 2. min, 4. K/min, 250. C @ 10. min
CapillaryFFAP1060.Lozano P.R., Drake M., et al., 200730. m/0.25 mm/0.25 μm, He, 35. C @ 5. min, 10. K/min, 225. C @ 25. min
CapillarySupelcowax-101024.Elmore, Nisyrios, et al., 200560. m/0.25 mm/0.25 μm, He, 40. C @ 2. min, 4. K/min; Tend: 280. C
CapillaryAT-Wax1000.Pino, Almora, et al., 200360. m/0.32 mm/0.25 μm, He, 65. C @ 10. min, 2. K/min, 250. C @ 60. min
CapillarySupelcowax-101024.Chung, Yung, et al., 200260. m/0.25 mm/0.25 μm, He, 35. C @ 5. min, 2. K/min, 195. C @ 90. min
CapillarySupelcowax-101024.Chung, Yung, et al., 200160. m/0.25 mm/0.25 μm, He, 35. C @ 5. min, 2. K/min, 195. C @ 90. min
CapillaryDB-Wax1056.Beauchene, Grua-Priol, et al., 200060. m/0.32 mm/0.5 μm, He, 3. K/min, 160. C @ 5. min; Tstart: 30. C
CapillaryDB-Wax1019.Shimoda, Shigematsu, et al., 199560. m/0.25 mm/0.25 μm, 2. K/min; Tstart: 50. C; Tend: 230. C
CapillaryDB-Wax1019.Shimoda, Shigematsu, et al., 1995, 260. m/0.25 mm/0.25 μm, He, 2. K/min; Tstart: 50. C; Tend: 230. C
CapillarySupelcowax-101025.Tanchotikul and Hsieh, 198960. m/0.25 mm/0.25 μm, 40. C @ 5. min, 2. K/min, 175. C @ 20. min
CapillarySupelcowax-101025.Tanchotikul and Hsieh, 198960. m/0.25 mm/0.25 μm, 40. C @ 5. min, 2. K/min, 175. C @ 20. min

Van Den Dool and Kratz RI, polar column, custom temperature program

View large format table.

Column type Active phase I Reference Comment
CapillarySupelcowax-101024.Bianchi, Careri, et al., 200730. m/0.25 mm/0.25 μm, He; Program: 35C(8min) => 4C/min => 60C => 6C/min => 160C => 20C/min => 200C(1min)
CapillaryCP-Wax 52CB1023.Condurso, Verzera, et al., 200660. m/0.25 mm/0.25 μm, He; Program: 45C(5min) => 10C/min => 80C => 2C/min => 240C
CapillaryHP-FFAP1034.Carrapiso, Ventanas, et al., 200230. m/0.32 mm/0.25 μm; Program: 35C(5min) => 10C/min => 150C => 20C/min => 250C(10 min)
CapillaryHP-Innowax1041.Koprivnjak, Conte, et al., 200230. m/0.32 mm/0.5 μm, He; Program: 40C(4min) => 10C/min => 70C => 5C/min => 150C => 10C/min => 250C (10min)
CapillaryFFAP1026.Buettner and Schieberle, 199930. m/0.32 mm/0.25 μm, He; Program: 35C (2min) => 40C/min => 60C (2min) => 6C/min => 180C => 10C/min => 230C (10min)
CapillaryFFAP1026.Hinterholzer, Lemos, et al., 199830. m/0.32 mm/0.25 μm, He; Program: 35C(2min) => 40C/min => 60C(2min) => 6C/min => 180C => 10C/min => 230C(10 min)
CapillaryDB-Wax1018.Prost, Serot, et al., 199830. m/0.32 mm/0.5 μm; Program: 50C => 3C/min => 180C => 5C/min => 250C (15min)
CapillaryC30W973.Ullrich and Grosch, 1988Program: not specified

Normal alkane RI, non-polar column, temperature ramp

View large format table.

Column type Active phase I Reference Comment
CapillaryVF-5 MS685.Srisajjalerwaja, Apichartsrangkoon, et al., 201260. m/0.25 mm/0.25 μm, Helium, 40. C @ 2. min, 4. K/min; Tend: 250. C
CapillaryHP-5 MS684.Kim and Chung, 200930. m/0.25 mm/0.25 μm, Helium, 35. C @ 5. min, 2. K/min, 195. C @ 30. min
CapillaryRTX-5 MS680.Watcharananun, Cadwallader, et al., 200930. m/0.25 mm/0.50 μm, Helium, 35. C @ 5. min, 6. K/min, 225. C @ 10. min
CapillaryHP-1660.Berlioz, Cordella, et al., 200650. m/0.2 mm/0.33 μm, N2, 2. K/min, 250. C @ 20. min; Tstart: 60. C
CapillaryUltra-2685.Ceva-Antunes, Bizzo, et al., 200625. m/0.25 mm/0.33 μm, H2, 40. C @ 2. min, 3. K/min, 280. C @ 10. min
CapillarySPB-1654.Vichi, Castellote, et al., 200330. m/0.25 mm/0.25 μm, He, 40. C @ 10. min, 3. K/min; Tend: 200. C
CapillarySPB-1654.Vichi, Pizzale, et al., 200330. m/0.25 mm/0.25 μm, He, 40. C @ 10. min, 3. K/min; Tend: 200. C
CapillarySPB-1662.Vichi, Pizzale, et al., 2003, 230. m/0.25 mm/0.25 μm, He, 40. C @ 10. min, 3. K/min; Tend: 200. C
CapillarySPB-1664.Wong and Lai, 199650. m/0.2 mm/0.33 μm, He, 40. C @ 3. min, 3. K/min, 200. C @ 30. min
CapillaryDB-1660.Buttery and Ling, 1995He, 30. C @ 25. min, 4. K/min, 200. C @ 20. min; Column length: 60. m; Column diameter: 0.25 mm
CapillaryDB-1658.Buttery, Teranishi, et al., 1990He, 30. C @ 25. min, 4. K/min, 200. C @ 5. min; Column length: 60. m; Column diameter: 0.25 mm

Normal alkane RI, non-polar column, custom temperature program

View large format table.

Column type Active phase I Reference Comment
CapillaryDB-5676.Miyazaki, Plotto, et al., 201160. m/0.25 mm/1.00 μm, Helium; Program: 40 0C 4 0C/min -> 230 0C 100 0C/min -> 260 0C (11.7 min)
CapillaryDB-1657.Delort and Jaquier, 200960. m/0.25 mm/0.25 μm, Helium; Program: 50 0C (5 min) 3 0C/min -> 120 0C 5 0C/min -> 250 0C (3 min) 15 0C/min -> 300 0C (20 min)
CapillaryHP-5678.Carrapiso and Garsia, 200750. m/0.32 mm/1.05 μm; Program: 35 0C (10 min) 10 0C/min -> 150 0C 20 0C/min -> 250 0C (10 min)
CapillaryHP-5680.Jordán, Margaría, et al., 200230. m/0.25 mm/0.25 μm; Program: 40C (6min) => 2.5C/min => 150C => 90C/min => 250C
CapillaryDB-5683.Matsui, Guth, et al., 199830. m/0.32 mm/0.25 μm, He; Program: 35C(1min) => 40C/min => 60C (1min) => 6C/min => 230C
CapillarySE-54682.Reiners and Grosch, 199830. m/0.32 mm/0.25 μm; Program: 35 0C (2 min) 40 0C/min -> 50 0C (1 min) 6 0C/min -> 230 0C
CapillaryDB-1658.Binder, Flath, et al., 1989Column length: 60. m; Column diameter: 0.32 mm; Program: not specified
CapillarySF96+Igepal676.Flath, Altieri, et al., 1984Column length: 152. m; Column diameter: 0.76 mm; Program: 25C(1min) => 5C/min => 50C (4min) => 1.25C/min => 180C

Normal alkane RI, polar column, temperature ramp

View large format table.

Column type Active phase I Reference Comment
CapillaryCP Wax 52 CB1031.Birtic, Ginies, et al., 200930. m/0.32 mm/0.50 μm, Helium, 40. C @ 2. min, 4. K/min, 230. C @ 15. min
CapillaryCP-Wax1036.Mo, Fan, et al., 200960. m/0.25 mm/0.25 μm, Helium, 50. C @ 2. min, 6. K/min, 230. C @ 15. min
CapillaryStabilwax1021.Watcharananun, Cadwallader, et al., 200930. m/0.25 mm/0.50 μm, Helium, 35. C @ 5. min, 6. K/min, 225. C @ 10. min
CapillaryDB-Wax1022.Ganeko, Shoda, et al., 20084. K/min; Column length: 60. m; Column diameter: 0.35 mm; Tstart: 40. C; Tend: 200. C
CapillaryTR-WAX1016.Tena N., Lazzez A., et al., 200760. m/0.25 mm/0.25 μm, H2, 40. C @ 10. min, 3. K/min, 200. C @ 10. min
CapillaryTR-WAX973.Salas J.J., Garcia-Gonzalez D.L., et al., 200660. m/0.25 mm/0.25 μm, He, 40. C @ 10. min, 3. K/min; Tend: 200. C
CapillaryTR-WAX973.Salas, Sánchez, et al., 200560. m/0.25 mm/0.25 μm, H2, 40. C @ 10. min, 3. K/min; Tend: 200. C
CapillarySupelcowax-101016.Vichi, Castellote, et al., 200330. m/0.25 mm/0.25 μm, He, 40. C @ 10. min, 3. K/min; Tend: 200. C
CapillarySupelcowax-101013.Vichi, Pizzale, et al., 200330. m/0.25 mm/0.25 μm, He, 40. C @ 10. min, 3. K/min; Tend: 200. C
CapillarySupelcowax-101013.Vichi, Pizzale, et al., 2003, 230. m/0.25 mm/0.25 μm, He, 40. C @ 10. min, 3. K/min; Tend: 200. C
CapillaryDB-Wax1038.Jiang and Kubota, 2001He, 2. K/min; Column length: 60. m; Column diameter: 0.25 mm; Tstart: 40. C; Tend: 220. C
CapillaryDB-Wax1017.Umano, Nakahara, et al., 199960. m/0.25 mm/0.25 μm, He, 40. C @ 2. min, 2. K/min; Tend: 200. C
CapillaryDB-Wax1014.Horiuchi, Umano, et al., 199860. m/0.25 mm/1. μm, He, 3. K/min, 200. C @ 40. min; Tstart: 50. C
CapillaryInnowax1019.Petersen, Poll, et al., 199830. m/0.25 mm/0.25 μm, 40. C @ 10. min, 6. K/min, 240. C @ 25. min
CapillarySupelcowax-101029.Wong and Lai, 199660. m/0.25 mm/0.25 μm, He, 40. C @ 3. min, 3. K/min, 200. C @ 30. min
CapillaryCarbowax 20M991.Kawakami, Ganguly, et al., 199560. C @ 4. min, 2. K/min; Column length: 60. m; Column diameter: 0.25 mm; Tend: 180. C
CapillaryDB-Wax1020.Umano, Hagi, et al., 1995He, 40. C @ 2. min, 2. K/min; Column length: 60. m; Column diameter: 0.25 mm; Tend: 200. C
CapillaryCarbowax 20M991.Kawakami and Kobayashi, 1991He, 60. C @ 4. min, 2. K/min; Column length: 50. m; Column diameter: 0.25 mm; Tend: 180. C
CapillaryDB-Wax1016.Binder, Flath, et al., 198950. C @ 0.1 min, 4. K/min, 230. C @ 10. min; Column length: 60. m; Column diameter: 0.32 mm
CapillarySupelcowax-101022.Hsieh, Williams, et al., 198960. m/0.25 mm/0.25 μm, He, 40. C @ 5. min, 1. K/min; Tend: 175. C
CapillaryCarbowax 20M1000.Buttery, Kamm, et al., 19841. K/min, 170. C @ 30. min; Column length: 150. m; Column diameter: 0.64 mm; Tstart: 50. C

References

Johanningsmeier and McFeeters, 2011
Johanningsmeier, S.D.; McFeeters, R.F., Detection of volatile spoilage metabolites in fermented cucumbers using nontargeted, comprehensive 2-dimensional gas chromatography-time-of-flight mass spectrometry (GCxGCxTOFMS), J. Food Sci., 2011, 76, 1, c168-c177, https://doi.org/10.1111/j.1750-3841.2010.01918.x . [all data]

Miyazaki, Plotto, et al., 2011
Miyazaki, T.; Plotto, A.; Goodner, K.; Gmitter F.G., Distribution of aroma volatile compounds in tangerine hybrids and proposed inheritance, J. Sci. Food Agric., 2011, 91, 3, 449-460, https://doi.org/10.1002/jsfa.4205 . [all data]

Vekiari, Orepoulou, et al., 2010
Vekiari, S.A.; Orepoulou, V.; Kourkoutas, Y.; Kamoun, N.; Msallem, M.; Psimouli, V.; Arapoglou, D., Characterization and seasonal variations of the quality of virgin olive oil of the Thoumbolia and Koroneiki varieties from Southern Greece, Grasas y Aceites, 2010, 61, 3, 221-231, https://doi.org/10.3989/gya.108709 . [all data]

Romeo, Verzera, et al., 2009
Romeo, V.; Verzera, A.; Ziino, M.; Condurao, C.; Tripodi, G., Headspace volatiles of Vicia sativa L. (Legumnodeae) by solid-phase microextraction and gas chromatography/mass spectrometry, J. Ess. Oil Res., 2009, 21, 1, 33-35, https://doi.org/10.1080/10412905.2009.9700101 . [all data]

Carrapiso and Garsia, 2007
Carrapiso, A.I.; Garsia, C., Effect of sampling conditions on the odour-active compounds of iberian ham, Cienc. Technol. Aliment., 2007, 5, 4, 287-290, https://doi.org/10.1080/11358120709487703 . [all data]

Narain, Galvao, et al., 2007
Narain, N.; Galvao, M. deS.; Ferreira, D.DaS.; Navarro, D.M.A.F., Flavor biogeneration in Mangaba (Hancornia speciosa Gomes) fruit, BioEng. Campinas, 2007, 1, 1, 25-31. [all data]

Narain, Galvao, et al., 2007, 2
Narain, N.; Galvao, M.S.; Madruga, M.S., Volatile compounds captured through purge and trap technique in caja-umbu (Spondias sp.) fruits during maturation, Food Chem., 2007, 102, 3, 726-731, https://doi.org/10.1016/j.foodchem.2006.06.003 . [all data]

Dhifi, Angerosa, et al., 2005
Dhifi, W.; Angerosa, F.; Serraiocco, A.; Oumar, I.; Hamrouni, I.; Marzouk, B., Virgin olive oil aroma: Characterization of some Tunisian cultivars, Food Chem., 2005, 93, 4, 697-701, https://doi.org/10.1016/j.foodchem.2004.12.036 . [all data]

Kim. J.H., Ahn, et al., 2004
Kim. J.H.; Ahn, H.J.; Yook, H.S.; Kim, K.S.; Rhee, M.S.; Ryu, G.H.; Byun, M.W., Color, flavor, and sensory characteristics of gamma-irradiated salted and fermented anchovy sauce, Radiation Phys. Chem., 2004, 69, 2, 179-187, https://doi.org/10.1016/S0969-806X(03)00400-6 . [all data]

Piveteau, le Guen, et al., 2000
Piveteau, F.; le Guen, S.; Gandemer, G.; Baud, J.-P.; Demaimay, M., Aroma of fresh oysters Crassostrea gigas: composition and aroma notes, J. Agric. Food Chem., 2000, 48, 10, 4851-4857, https://doi.org/10.1021/jf991394k . [all data]

Reiners and Grosch, 1998
Reiners, J.; Grosch, W., Odorants of virgin olive oils with different flavor profiles, J. Agric. Food Chem., 1998, 46, 7, 2754-2763, https://doi.org/10.1021/jf970940b . [all data]

Castioni and Kapetanidis, 1996
Castioni, P.; Kapetanidis, I., Volatile constituents from Brunfelsia grandiflora ssp. grandiflora: qualitative analysis by GC-MS, Scientia Pharmaceutica, 1996, 64, 83-91. [all data]

Luning, Carey, et al., 1995
Luning, P.A.; Carey, A.T.; Roozen, J.P.; Wichers, H.J., Characterization and occurrence of lipoxygenase in bell peppers at different ripening stages in relation to the formation of volatile flavor compounds, J. Agric. Food Chem., 1995, 43, 6, 1493-1500, https://doi.org/10.1021/jf00054a015 . [all data]

Luning, de Rijk, et al., 1994
Luning, P.A.; de Rijk, T.; Wichers, H.J.; Roozen, J.P., Gas chromatography, mass spectrometry, and sniffing port analyses of volatile compounds of fresh bell peppers (Capsicum annuum) at different ripening stages, J. Agric. Food Chem., 1994, 42, 4, 977-983, https://doi.org/10.1021/jf00040a027 . [all data]

Binder, Flath, et al., 1989
Binder, R.G.; Flath, R.A.; Mon, T.R., Volatile components of bittermelon, J. Agric. Food Chem., 1989, 37, 2, 418-420, https://doi.org/10.1021/jf00086a032 . [all data]