Benzo[1,2-c:3,4-c':5,6-c'']tris[1,2,5]oxadiazole

Phase change data

Data compiled by: William E. Acree, Jr., James S. Chickos

Enthalpy of sublimation

ΔsubH (kJ/mol) Temperature (K) Reference
95.8 ± 3.8303. - 333.Matyushin, Pepekin, et al., 1999

References

Matyushin, Pepekin, et al., 1999
Matyushin, Y.N.; Pepekin, V.I.; Lebedev, V.P.; Chironov, V.V.; Kostikova, L.M.; Inozemtcev, Y.O.; Pivina, T.S.; Sheremetev, A.B., Thermochemical properties and quantum-chemical parameters of benzotrifurazan and its N-oxides, International Annual Conference of ICT, 1999, 30, 77/1. [all data]