1,4-Dimethyladamantane

Kovats' RI, non-polar column, isothermal

View large format table.

Column type Active phase Temperature (C) I Reference Comment
PackedSE-30120.1183.Mitra, Mohan, et al., 1974N2, Chrom W; Column length: 6.1 m
PackedSE-30130.1189.Mitra, Mohan, et al., 1974N2, Chrom W; Column length: 6.1 m

References

Mitra, Mohan, et al., 1974
Mitra, G.D.; Mohan, G.; Sinha, A., Advances in the utilization of the retention index system for characterizing hydrocarbons in complex mixtures by gas chromatography, J. Chromatogr., 1974, 99, 215-230, https://doi.org/10.1016/S0021-9673(00)90857-4 . [all data]