4,4'-di-tert-Butylbiphenyl

Phase change data

Data compiled as indicated in comments:
TRC - Thermodynamics Research Center, NIST Boulder Laboratories, Chris Muzny director
AC - William E. Acree, Jr., James S. Chickos

Quantity Value Units Method Reference Comment
Tfus392.KN/ARomadane and Berga, 1958Uncertainty assigned by TRC = 6. K; TRC
Tfus390.KN/AKnauf and Adams, 1933Uncertainty assigned by TRC = 4. K; TRC
Tfus402.KN/AChichibabin, Elgazin, et al., 1928Uncertainty assigned by TRC = 3. K; TRC
Tfus395.KN/ASchreiner, 1910Uncertainty assigned by TRC = 4. K; TRC
Quantity Value Units Method Reference Comment
Δvap86.2 ± 3.2kJ/molS-VNti-Gyabaah, Chan, et al., 2009AC
Quantity Value Units Method Reference Comment
Δsub106.8 ± 3.2kJ/molCMelkhanova, Pimenova, et al., 2009AC

Enthalpy of fusion

ΔfusH (kJ/mol) Temperature (K) Method Reference Comment
20.0400.8DSCMelkhanova, Pimenova, et al., 2009AC
18.8402.DSCNäther, Jeß, et al., 2002AC

In addition to the Thermodynamics Research Center (TRC) data available from this site, much more physical and chemical property data is available from the following TRC products:

Reaction thermochemistry data

Data compiled by: Hussein Y. Afeefy, Joel F. Liebman, and Stephen E. Stein

Individual Reactions

4,4'-di-tert-Butylbiphenyl = C20H26

By formula: C20H26 = C20H26

Quantity Value Units Method Reference Comment
Δr0.4 ± 2.2kJ/molEqkRoshchupkina, Nesterova, et al., 1987liquid phase; T=358.7 K

References

Romadane and Berga, 1958
Romadane, I.A.; Berga, S.E., Alkylation of Biphenyl with Alcohols in the Presence of Boron Trifluoride- phosphoric Acid Catalyst, Zh. Obshch. Khim., 1958, 28, 413-7. [all data]

Knauf and Adams, 1933
Knauf; Adams, J.S., J. Am. Chem. Soc., 1933, 55, 4704. [all data]

Chichibabin, Elgazin, et al., 1928
Chichibabin, A.E.; Elgazin; Lengold, Zh. Russ. Fiz.-Khim. O-va., Chast Khim., 1928, 60, 347. [all data]

Schreiner, 1910
Schreiner, E., J. Prakt. Chem., 1910, 81, 422. [all data]

Nti-Gyabaah, Chan, et al., 2009
Nti-Gyabaah, J.; Chan, V.; Chiew, Y.C., Solubility and limiting activity coefficient of simvastatin in different organic solvents, Fluid Phase Equilibria, 2009, 280, 1-2, 35-41, https://doi.org/10.1016/j.fluid.2009.03.006 . [all data]

Melkhanova, Pimenova, et al., 2009
Melkhanova, Svetlana V.; Pimenova, Svetlana M.; Chelovskaya, Nelly V.; Miroshnichenko, Eugenii A.; Pashchenko, Larisa L.; Nesterov, Igor A.; Naumkin, P.V., Thermochemical studies of 4-tert-butylbiphenyl and 4,4´-di-tert-butylbiphenyl, The Journal of Chemical Thermodynamics, 2009, 41, 5, 651-653, https://doi.org/10.1016/j.jct.2008.12.015 . [all data]

Näther, Jeß, et al., 2002
Näther, Christian; Jeß, Inke; Havlas, Zdenek; Bolte, Michael; Nagel, Norbert; Nick, Sabine, Trimorphism of 4,4´-Di(tert.-butyl)-biphenyl: structural, thermodynamic and kinetic aspects, Solid State Sciences, 2002, 4, 6, 859-871, https://doi.org/10.1016/S1293-2558(02)01324-9 . [all data]

Roshchupkina, Nesterova, et al., 1987
Roshchupkina, I.Yu.; Nesterova, T.N.; Rozhnov, A.M., Equilibria of isomeric transformations of alkylbiphenyls, J. Chem. Thermodyn., 1987, 19, 299-306. [all data]