Ethanone, 1-(1,3-dimethyl-1H-indol-2-yl)-

Normal alkane RI, non-polar column, custom temperature program

Data compiled by: NIST Mass Spectrometry Data Center, William E. Wallace, director

Column type Capillary
Active phase SE-54
Column length (m) 35.
Carrier gas He
Substrate
Column diameter (mm) 0.25
Phase thickness (μm)
Program not specified
I 1852.
ReferenceFagan, Kepner, et al., 1982
Comment MSDC-RI

References

Fagan, Kepner, et al., 1982
Fagan, G.L.; Kepner, R.E.; Webb, A.D., Additional volatile components of Palomino film sherry, Am. J. Enol. Vitic, 1982, 33, 1, 47-50. [all data]