Clonazepam

Kovats' RI, non-polar column, isothermal

Data compiled by: NIST Mass Spectrometry Data Center, William E. Wallace, director

Column type CapillaryCapillaryCapillaryCapillaryPacked
Active phase BP-1DB-1BP-1BP-1SE-30
Column length (m) 25.30.25.25.2.
Carrier gas N2N2N2N2N2
Substrate     1% se-30 on Anachrom ABS(80-100mesh)
Column diameter (mm) 0.220.530.220.53
Phase thickness (μm) 0.251.50.251.
Temperature (C) 250.250.275.275.280.
I 2833.2806.2832.2856.2878.
ReferenceJapp, Garthwaite, et al., 1988Japp, Garthwaite, et al., 1988Japp, Gill, et al., 1987Japp, Gill, et al., 1987Musumarra, Scarlata, et al., 1987
Comment MSDC-RI MSDC-RI MSDC-RI MSDC-RI MSDC-RI

References

Japp, Garthwaite, et al., 1988
Japp, M.; Garthwaite, K.; Geeson, A.V.; Osselton, M.D., Collection of Analytical Data for Benzodiazepines and Benzophenones, J. Chromatogr., 1988, 439, 2, 317-339, https://doi.org/10.1016/S0021-9673(01)83844-9 . [all data]

Japp, Gill, et al., 1987
Japp, M.; Gill, R.; Osselton, M.D., Comparison of drug retention indices determined on packed, wide bore capillary and narrow bore capillary columns, J. Forensic Sci., 1987, 32, 6, 1574-1586. [all data]

Musumarra, Scarlata, et al., 1987
Musumarra, G.; Scarlata, G.; Romano, G.; Cappello, G.; Clementi, S.; Giulietti, G., Qualitative organic analysis. Part 2. Identification of drugs by principal components analysis of standardized TLC data in four eluent systems and of retention indices on SE 30, J. Anal. Toxicol., 1987, 11, 4, 154-163, https://doi.org/10.1093/jat/11.4.154 . [all data]