((3S,3aR,6R,8aS)-7,7-Dimethyl-8-methyleneoctahydro-1H-3a,6-methanoazulen-3-yl)methanol

Normal alkane RI, non-polar column, custom temperature program

Data compiled by: NIST Mass Spectrometry Data Center, William E. Wallace, director

Column type CapillaryCapillary
Active phase DB-5CP Sil 5 CB
Column length (m) 30.25.
Carrier gas He
Substrate
Column diameter (mm) 0.25
Phase thickness (μm) 0.25
Program 40C (5min) => 2C/min => 250C(15min) => 5C/min => 270C (10min)not specified
I 1735.1726.
ReferenceMassardo, Senatore, et al., 2006Weyerstahl, Marschall, et al., 2000
Comment MSDC-RI MSDC-RI

References

Massardo, Senatore, et al., 2006
Massardo, D.R.; Senatore, F.; Alifano, P.; del Giudice, L.; Pontieri, P., Vetiver oil production correlates with early root growth, Biochem. Syst. Ecol., 2006, 34, 5, 376-382, https://doi.org/10.1016/j.bse.2005.10.016 . [all data]

Weyerstahl, Marschall, et al., 2000
Weyerstahl, P.; Marschall, H.; Splittgerber, U.; Wolf, D.; Surburg, H., Constituents of Haitian vetiver oil, Flavour Fragr. J., 2000, 15, 6, 395-412, https://doi.org/10.1002/1099-1026(200011/12)15:6<395::AID-FFJ930>3.0.CO;2-9 . [all data]