3,6-Diphenyl-1,2-dithiin

Gas phase thermochemistry data

Data compiled by: Hussein Y. Afeefy, Joel F. Liebman, and Stephen E. Stein

Quantity Value Units Method Reference Comment
Δfgas422.4 ± 3.6kJ/molCcbGeiseler and Sawistowsky, 1973Reanalyzed by Pedley, Naylor, et al., 1986, Original value = 423.0 kJ/mol

Condensed phase thermochemistry data

Data compiled by: Hussein Y. Afeefy, Joel F. Liebman, and Stephen E. Stein

Quantity Value Units Method Reference Comment
Δcsolid-9455.0kJ/molCcbGeiseler and Sawistowsky, 1973

Phase change data

Data compiled as indicated in comments:
AC - William E. Acree, Jr., James S. Chickos
ALS - Hussein Y. Afeefy, Joel F. Liebman, and Stephen E. Stein

Quantity Value Units Method Reference Comment
Δsub183.1 ± 2.5kJ/molN/AGeiseler and Sawistowsky, 1973, 2See also Pedley and Rylance, 1977.; AC
Δsub183.1 ± 2.5kJ/molVGeiseler and Sawistowsky, 1973Reanalyzed by Pedley, Naylor, et al., 1986, Original value = 174. ± 3. kJ/mol; ALS

Enthalpy of sublimation

ΔsubH (kJ/mol) Temperature (K) Reference Comment
174.5 ± 2.5355.Geiseler and Sawistowsky, 1973, 2See also Pedley and Rylance, 1977.; AC

References

Geiseler and Sawistowsky, 1973
Geiseler, G.; Sawistowsky, J., Bildungsenthalpien und Mesomerieenergien von π-Bindungssystemen. 7. Mitteilung: Bildungsenthalpie des 3,6-Diphenyldithiins, Z. Phys. Chem. (Leipzig), 1973, 253, 333-336. [all data]

Pedley, Naylor, et al., 1986
Pedley, J.B.; Naylor, R.D.; Kirby, S.P., Thermochemical Data of Organic Compounds, Chapman and Hall, New York, 1986, 1-792. [all data]

Geiseler and Sawistowsky, 1973, 2
Geiseler, G.; Sawistowsky, J., Z. Phys. Chem. (Leipzig), 1973, 253, 333. [all data]

Pedley and Rylance, 1977
Pedley, J.B.; Rylance, J., , Computer Analysed Thermochemical Data: Organic and Organometallic Compounds, University of Sussex, Brighton, 1977. [all data]