(E)-1-Methyl-4-(2-phenylethenyl)sulphonylbenzene

Gas phase thermochemistry data

Data compiled by: Hussein Y. Afeefy, Joel F. Liebman, and Stephen E. Stein

Quantity Value Units Method Reference Comment
Δfgas-69.6 ± 5.3kJ/molCcrMackle, McNally, et al., 1969Reanalyzed by Cox and Pilcher, 1970, Original value = -69.0 ± 5.4 kJ/mol; Heat of combustion corrected for pressure

Phase change data

Data compiled by: Hussein Y. Afeefy, Joel F. Liebman, and Stephen E. Stein

Quantity Value Units Method Reference Comment
Δsub108. ± 2.kJ/molVMackle, McNally, et al., 1969Heat of combustion corrected for pressure

References

Mackle, McNally, et al., 1969
Mackle, H.; McNally, D.V.; Steele, W.V., Studies in the thermochemistry of sulphones. Part 10. Heats of combustion and formation of several αβ-unsaturated sulphones, Trans. Faraday Soc., 1969, 65, 2060-2068. [all data]

Cox and Pilcher, 1970
Cox, J.D.; Pilcher, G., Thermochemistry of Organic and Organometallic Compounds, Academic Press, New York, 1970, 1-636. [all data]