2-Methoxy-2-methylpentanenitrile

Phase change data

Data compiled as indicated in comments:
ALS - Hussein Y. Afeefy, Joel F. Liebman, and Stephen E. Stein
AC - William E. Acree, Jr., James S. Chickos

Quantity Value Units Method Reference Comment
Δvap11.60 ± 0.14kcal/molVVerevkin, Beckhaus, et al., 1995ALS
Δvap11.6 ± 0.1kcal/molGSVerevkin, Beckhaus, et al., 1995Based on data from 278. - 308. K.; AC

References

Verevkin, Beckhaus, et al., 1995
Verevkin, S.P.; Beckhaus, H.-D.; Ruchardt, C., Geminale substituenteneffekte. Teil 6. Standardbildungsenthalpien von alkylsubstituierten-alkoxynitrilen und α-cyano-carbonsaureestern, Thermochim. Acta, 1995, 249, 1-11. [all data]