(3S,3aR,6R,8aS)-7,7-Dimethyl-8-methyleneoctahydro-1H-3a,6-methanoazulene-3-carboxylic acid

Van Den Dool and Kratz RI, non-polar column, temperature ramp

View large format table.

Column type Active phase I Reference Comment
CapillaryCP Sil 5 CB1837.Martinez, Rosa, et al., 200430. m/0.25 mm/0.25 μm, N2, 5. K/min; Tstart: 50. C; Tend: 200. C

Normal alkane RI, non-polar column, temperature ramp

View large format table.

Column type Active phase I Reference Comment
CapillaryHP-5 MS1811.Phungpanya, Thongpoon, et al., 201230. m/0.25 mm/0.25 μm, Helium, 2. K/min; Tstart: 50. C; Tend: 180. C
CapillaryHP-51871.Champagnat, Figueredo, et al., 200625. m/0.25 mm/0.25 μm, He, 50. C @ 5. min, 5. K/min; Tend: 300. C

Normal alkane RI, non-polar column, custom temperature program

View large format table.

Column type Active phase I Reference Comment
CapillarySLB-5 MS1812.Mondello, 201230. m/0.25 mm/0.25 μm, Helium; Program: not specified
CapillarySLB-5 MS1823.Mondello, 201230. m/0.25 mm/0.25 μm, Helium; Program: not specified
CapillaryDB-5 MS1803.Lima, Quintans-Junior, et al., 2011Helium; Column length: 30. m; Column diameter: 0.25 mm; Program: 50 0C (1.5 min) 4 0C/min -> 200 0C 10 0C/min -> 300 0C (10 min)
CapillaryDB-51860.Massardo, Senatore, et al., 200630. m/0.25 mm/0.25 μm, He; Program: 40C (5min) => 2C/min => 250C(15min) => 5C/min => 270C (10min)

References

Martinez, Rosa, et al., 2004
Martinez, J.; Rosa, P.T.V.; Menut, C.; Leydet, A.; Brat, P.; Pallet, D.; Meireles, M.A.A., Valorization of Brazilian vetiver (Vetiveria zizanioides (L.) Nash ex Small) oil, J. Agric. Food Chem., 2004, 52, 21, 6578-6584, https://doi.org/10.1021/jf049182x . [all data]

Phungpanya, Thongpoon, et al., 2012
Phungpanya, C.; Thongpoon, C.; Pripdeevech, P.; Machan, T., Analysis of aroma volatiles from fresh leaves of Plectranthus amboinicus using solid phase microextraction (SPME) technique, Pure and Applied Chemistry International Conference 2012 (PACCON 2012), 2012, 16701672. [all data]

Champagnat, Figueredo, et al., 2006
Champagnat, P.; Figueredo, G.; Chalchat, J.-C.; Bessiere, J.-M., Essential oil composition of Vetiveria nigritana from Mali, J. Essent. Oil Res., 2006, 18, 6, 647-649, https://doi.org/10.1080/10412905.2006.9699193 . [all data]

Mondello, 2012
Mondello, L., HS-SPME-GCxGC-MS analysis of Yerba Mate (Ilex paraguariensis) in Shimadzu GC-GC application compendium of comprehensive 2D GC, Vol. 1-5, Shimadzu Corp., 2012, 1-29. [all data]

Lima, Quintans-Junior, et al., 2011
Lima, G.M.; Quintans-Junior, L.J.; Thomazzi, S.M.; Almeida, E.M.S.A.; Melo, M.S.; Serafini, M.R.; Cavalcanti, S.C.H.; Gelain, D.P.; Santos, J.P.A.; Blank, A.F.; Alves, P.B.; Neta, P.M.O.; Lima, J.T.; Rocha, R.F.; Moreira, J.C.F.; Araujo, A.A.S., Phytochemical screening, antinociceptive and anti-inflammatory activities of Chrysopogon zizanioides essential oil, Braz. J. Pharmacognosy, 2011, 1-8. [all data]

Massardo, Senatore, et al., 2006
Massardo, D.R.; Senatore, F.; Alifano, P.; del Giudice, L.; Pontieri, P., Vetiver oil production correlates with early root growth, Biochem. Syst. Ecol., 2006, 34, 5, 376-382, https://doi.org/10.1016/j.bse.2005.10.016 . [all data]