(1S,2R,4R,7R)-4-Isopropyl-7-methyl-3,8-dioxatricyclo[5.1.0.02,4]octane

Van Den Dool and Kratz RI, non-polar column, custom temperature program

View large format table.

Column type Active phase I Reference Comment
CapillaryHP-5MS1309.9Andriamaharavo, 201430. m/0.25 mm/0.25 μm, He; Program: 60C (1 min) => 5 C/min => 210C => 10 C/min => 280C (15 min)

Normal alkane RI, non-polar column, temperature ramp

View large format table.

Column type Active phase I Reference Comment
CapillaryHP-51303.Bertoli, Lepnardi, et al., 201130. m/0.25 mm/0.25 μm, Helium, 3. K/min; Tstart: 60. C; Tend: 240. C
CapillarySLB-5 MS1308.Scandinaro, Tranchida, et al., 201010. m/0.10 mm/0.10 μm, Helium, 10. K/min; Tstart: 50. C; Tend: 250. C
CapillaryDB-51302.Koba, Catherine, et al., 200930. m/0.25 mm/0.25 μm, Helium, 5. K/min; Tstart: 50. C; Tend: 250. C

Normal alkane RI, non-polar column, custom temperature program

View large format table.

Column type Active phase I Reference Comment
CapillarySLB-5 MS1306.Scandinaro, Tranchida, et al., 201010. m/0.10 mm/0.10 μm, Helium; Program: not specified

References

Andriamaharavo, 2014
Andriamaharavo, N.R., Retention Data. NIST Mass Spectrometry Data Center., NIST Mass Spectrometry Data Center, 2014. [all data]

Bertoli, Lepnardi, et al., 2011
Bertoli, A.; Lepnardi, M.; Krzyzanowska, J.; Oleszek, W.; Pistelli, L., Mentha longifolia in vitro cultures as safe source of flavouring ingradients, Acta Biochem. Polonica, 2011, 58, 4, 581-587. [all data]

Scandinaro, Tranchida, et al., 2010
Scandinaro, M.; Tranchida, P.Q.; Costa, R.; Dugo, P.; Mondello, L., Rapid Quality Control of Flavours and Fragrances using Fast GC-MS and Multi-MS Library Search Procedures, LCGC Europe, 2010, 23, 9, 456-464. [all data]

Koba, Catherine, et al., 2009
Koba, K.; Catherine, G.; Raynaud, C.; Chaumont, J.-P.; Sanda, K.; Laurence, N., Chemical composition and cytotoxic activity of Chenopodium ambrosioides L. essential oil from Togo, Bangladesh J. Sci. Ind. Res., 2009, 44, 4, 435-440. [all data]