2-Methyl-2-propenyl p-tolyl sulphone

Gas phase thermochemistry data

Data compiled by: Hussein Y. Afeefy, Joel F. Liebman, and Stephen E. Stein

Quantity Value Units Method Reference Comment
Δfgas-57.7 ± 0.7kcal/molCcbMackle and Steele, 1969Heat of combustion corrected for pressure

Condensed phase thermochemistry data

Data compiled by: Hussein Y. Afeefy, Joel F. Liebman, and Stephen E. Stein

Quantity Value Units Method Reference Comment
Δfsolid-83.17 ± 0.30kcal/molCcbMackle and Steele, 1969Heat of combustion corrected for pressure
Quantity Value Units Method Reference Comment
Δcsolid-1573.49 ± 0.28kcal/molCcbMackle and Steele, 1969Heat of combustion corrected for pressure

Phase change data

Data compiled by: Hussein Y. Afeefy, Joel F. Liebman, and Stephen E. Stein

Quantity Value Units Method Reference Comment
Δsub25.5 ± 0.6kcal/molVMackle and Steele, 1969Heat of combustion corrected for pressure

References

Mackle and Steele, 1969
Mackle, H.; Steele, W.V., Studies in the thermochemistry of sulphones. Part II. - Heats of combustion and formation of several βγ and «gamma«δ- unsaturated sulphones, Trans. Faraday Soc., 1969, 65, 2069-2073. [all data]