1-Methyl-4-(2-methyl-1-propenylsulphonyl)-benzene

Phase change data

Data compiled by: Hussein Y. Afeefy, Joel F. Liebman, and Stephen E. Stein

Quantity Value Units Method Reference Comment
Δsub102. ± 2.kJ/molVMackle, McNally, et al., 1969Heat of combustion corrected for pressure

References

Mackle, McNally, et al., 1969
Mackle, H.; McNally, D.V.; Steele, W.V., Studies in the thermochemistry of sulphones. Part 10. Heats of combustion and formation of several αβ-unsaturated sulphones, Trans. Faraday Soc., 1969, 65, 2060-2068. [all data]