Phenol, 2-iodo-4-methyl-

Normal alkane RI, non-polar column, temperature ramp

View large format table.

Column type Active phase I Reference Comment
CapillaryTR-11259.Gruzdev, Kuzivanov, et al., 201230. m/0.32 mm/0.25 μm, Helium, 5. K/min; Tstart: 50. C; Tend: 300. C

References

Katzenellenbogen and Hsiung, 1975
Katzenellenbogen, J.A.; Hsiung, H.M., Biochemistry, 1975, 14, 1736. [all data]

Gruzdev, Kuzivanov, et al., 2012
Gruzdev, I.V.; Kuzivanov, I.M.; Zenkevich, I.G.; Kondratenok, B.M., Gas-chromatographic identification of products formed in iodination of methyl phenols by retention indices, Rus. J. Appl. Chem., 2012, 85, 9, 1355-1365, https://doi.org/10.1134/S1070427212090108 . [all data]