(PhO)CH3SO2

Reaction thermochemistry data

Data compiled by: Robert C. Dunbar

Individual Reactions

Lithium ion (1+) + C7H8O3S = (Lithium ion (1+) • C7H8O3S)

By formula: Li+ + C7H8O3S = (Li+ • C7H8O3S)

Quantity Value Units Method Reference Comment
Δr206.kJ/molCIDCBuncel, Decouzon, et al., 1997

Ion clustering data

Data compiled by: Robert C. Dunbar

Clustering reactions

Lithium ion (1+) + C7H8O3S = (Lithium ion (1+) • C7H8O3S)

By formula: Li+ + C7H8O3S = (Li+ • C7H8O3S)

Quantity Value Units Method Reference Comment
Δr206.kJ/molCIDCBuncel, Decouzon, et al., 1997

References

Buncel, Decouzon, et al., 1997
Buncel, E.; Decouzon, M.; Formento, A.; Gal, J.-F.; Herreros, M.; Li, L.; Maria, P.-C., Lithium-Cation and Proton Affinities of Sulfoxides and Sulfones: A Fourier Transform Ion Cyclotron Resonance Study, J. Am. Soc. Mass Spectrom., 1997, 8, 3, 262, https://doi.org/10.1016/S1044-0305(96)00255-3 . [all data]