p-Chlorocinnamic acid

Condensed phase thermochemistry data

Data compiled by: Hussein Y. Afeefy, Joel F. Liebman, and Stephen E. Stein

Quantity Value Units Method Reference Comment
Δfsolid  CcbZavoianu, Ciocazan, et al., 1990uncertain value: -308.6 kJ/mol; Undetermined error
Quantity Value Units Method Reference Comment
Δcsolid  CcbZavoianu, Ciocazan, et al., 1990uncertain value: -4183. kJ/mol; Undetermined error

References

Zavoianu, Ciocazan, et al., 1990
Zavoianu, D.; Ciocazan, I.; Moga-Gheorghe, S.; Bornaz, C., Structure and reactivity of acids. Heats of combustion and formation of some phenylacrylic acids., Rev. Chim. (Bucharest), 1990, 41, 234-236. [all data]