Butane, 1-(propylthio)-

Phase change data

Data compiled by: Thermodynamics Research Center, NIST Boulder Laboratories, Chris Muzny director

Quantity Value Units Method Reference Comment
Tboil431.KN/ABordwell, Andersen, et al., 1954Uncertainty assigned by TRC = 3. K

In addition to the Thermodynamics Research Center (TRC) data available from this site, much more physical and chemical property data is available from the following TRC products:

Kovats' RI, non-polar column, isothermal

View large format table.

Column type Active phase Temperature (C) I Reference Comment
PackedApiezon M130.985.Garbuzov, Misharina, et al., 1985He or N2, Chromosorb W, AW-DMCS; Column length: 2.1 m
PackedApiezon M130.985.Golovnya, Garbuzov, et al., 1976N2, Chromosorb W; Column length: 2.1 m
PackedApiezon L110.996.Martinu and Janák, 1970
PackedApiezon L130.992.Martinu and Janák, 1970
PackedApiezon L150.995.Martinu and Janák, 1970

Kovats' RI, polar column, isothermal

View large format table.

Column type Active phase Temperature (C) I Reference Comment
CapillaryPEG-20M93.1178.2Morishita, Murakita, et al., 1985Column length: 50. m; Column diameter: 0.25 mm
CapillaryPEG-20M80.1173.3Morishita, Murakita, et al., 1982N2; Column length: 50. m; Column diameter: 0.25 mm
PackedPolyethylene Glycol130.1196.Golovnya, Garbuzov, et al., 1976N2, Chromosorb W; Column length: 2.1 m

Normal alkane RI, non-polar column, custom temperature program

View large format table.

Column type Active phase I Reference Comment
CapillarySE-30972.Vinogradov, 2004Program: not specified

Normal alkane RI, polar column, custom temperature program

View large format table.

Column type Active phase I Reference Comment
CapillaryCarbowax 20M1173.Vinogradov, 2004Program: not specified

References

Bordwell, Andersen, et al., 1954
Bordwell, F.G.; Andersen, H.M.; Pitt, B.M., The Reaction of Thiacyclopropanes (Olefin Sulfes) and Thiacyclobutanes with Organolithium Compounds, J. Am. Chem. Soc., 1954, 76, 1082. [all data]

Garbuzov, Misharina, et al., 1985
Garbuzov, V.G.; Misharina, T.A.; Aerov, A.F.; Golovnya, R.V., Gas chromatographic retention indices for sulphur(II)-containing organic substances, J. Anal. Chem. USSR (Engl. Transl.), 1985, 40, 4, 576-586. [all data]

Golovnya, Garbuzov, et al., 1976
Golovnya, R.V.; Garbuzov, V.G.; Misharina, T.A., Gas chromatographic characteristics of sulfur compounds. 2. Normal sulfides, Izv. Akad. Nauk Kaz. SSR Ser. Khim., 1976, 10, 2266-2270. [all data]

Martinu and Janák, 1970
Martinu, V.; Janák, J., Gas-liquid chromatographic retention data of some aliphatic and alicyclic sulphides, J. Chromatogr., 1970, 52, 69-75, https://doi.org/10.1016/S0021-9673(01)96545-8 . [all data]

Morishita, Murakita, et al., 1985
Morishita, F.; Murakita, H.; Kojima, T., Prediction of retention indices of thiols and sulfides under different conditions of capillary gas chromatography, Bunseki Kagaku, 1985, 34, 12, 800-802, https://doi.org/10.2116/bunsekikagaku.34.12_800 . [all data]

Morishita, Murakita, et al., 1982
Morishita, F.; Murakita, H.; Takemura, Y.; Kojima, T., Prediction of molecular structures of thiols and sulphides by retention indices, J. Chromatogr., 1982, 239, 483-492, https://doi.org/10.1016/S0021-9673(00)82005-1 . [all data]

Vinogradov, 2004
Vinogradov, B.A., Production, composition, properties and application of essential oils, 2004, retrieved from http://viness.narod.ru. [all data]