p-Menthane-1,3-diol

Kovats' RI, non-polar column, isothermal

Data compiled by: NIST Mass Spectrometry Data Center, William E. Wallace, director

Column type Packed
Active phase Apiezon L
Column length (m)
Carrier gas
Substrate Chromosorb W AW
Column diameter (mm)
Phase thickness (μm)
Temperature (C) 130.
I 1394.
ReferenceParis and Alexandre, 1972
Comment MSDC-RI

References

Paris and Alexandre, 1972
Paris, C.; Alexandre, P., Stereochemical Investigation of Cyclohexane and Terpene Compounds by Gas Chromatography, J. Chromatogr. Sci., 1972, 10, 6, 402-411, https://doi.org/10.1093/chromsci/10.6.402 . [all data]