1-hexene, 4,5,5-trimethyl-

Phase change data

Data compiled by: Thermodynamics Research Center, NIST Boulder Laboratories, Chris Muzny director

Quantity Value Units Method Reference Comment
Tboil405.5KN/ALevina, Tantsyreva, et al., 1952Uncertainty assigned by TRC = 1.5 K

In addition to the Thermodynamics Research Center (TRC) data available from this site, much more physical and chemical property data is available from the following TRC products:

References

Levina, Tantsyreva, et al., 1952
Levina, R.Ya.; Tantsyreva, T.I.; Fainzil'berg, A.A., Synthesis of Hydrocarbons XX. Synthesis of Alkenes and Alkanes with A Quarternary Carbon Atom, Zh. Obshch. Khim., 1952, 22, 571. [all data]