CH2=CHCH=C radical

Gas phase ion energetics data

Data compiled by: John E. Bartmess

Electron affinity determinations

EA (eV) Method Reference Comment
0.914 ± 0.015LPESGunion, Koppel, et al., 1995

References

Gunion, Koppel, et al., 1995
Gunion, R.F.; Koppel, H.; Leach, G.W.; Lineberger, W.C., Photoelectron spectroscopy of C4H4-: Ab initio calculations and dynamics of the 1,2-hydrogen shift in vinylidene, J. Chem. Phys., 1995, 103, 4, 1250, https://doi.org/10.1063/1.469801 . [all data]