Tricyclo[6.2.0.03,6]deca-1(8),2,6-triene

Gas phase thermochemistry data

Data compiled by: Hussein Y. Afeefy, Joel F. Liebman, and Stephen E. Stein

Quantity Value Units Method Reference Comment
Δfgas310.kJ/molChydRoth, Adamczak, et al., 1991

Condensed phase thermochemistry data

Data compiled by: Hussein Y. Afeefy, Joel F. Liebman, and Stephen E. Stein

Quantity Value Units Method Reference Comment
Δfliquid310.kJ/molChydRoth, Langer, et al., 1991

Reaction thermochemistry data

Data compiled by: Hussein Y. Afeefy, Joel F. Liebman, and Stephen E. Stein

Individual Reactions

3Hydrogen + Tricyclo[6.2.0.0(3,6)]deca-1(8),2,6-triene = Tricyclo[6.2.0.0(3,6)]decane

By formula: 3H2 + C10H10 = C10H16

Quantity Value Units Method Reference Comment
Δr-245. ± 1.kJ/molChydRoth, Langer, et al., 1991liquid phase; solvent: benzene

3,4-Dimethylenebicyclo[4.2.0]octa-1,5-diene = Tricyclo[6.2.0.0(3,6)]deca-1(8),2,6-triene

By formula: C10H10 = C10H10

Quantity Value Units Method Reference Comment
Δr49. ± 1.kJ/molEqkRoth, Langer, et al., 1991liquid phase; At 812 °C

Gas phase ion energetics data

Data compiled as indicated in comments:
LLK - Sharon G. Lias, Rhoda D. Levin, and Sherif A. Kafafi

Ionization energy determinations

IE (eV) Method Reference Comment
8.17PESantiago, Gandour, et al., 1978LLK

References

Roth, Adamczak, et al., 1991
Roth, W.R.; Adamczak, O.; Breuckmann, R.; Lennartz, H.-W.; Boese, R., Die Berechnung von Resonanzenergien; das MM2ERW-Kraftfeld, Chem. Ber., 1991, 124, 2499-2521. [all data]

Roth, Langer, et al., 1991
Roth, W.R.; Langer, R.; Ebbrecht, T.; Beitat, A.; Lennartz, H.-W., 2,3,5,6-Tetramethylen-1,4-cyclohexadiyl, Chem. Ber., 1991, 124, 2751-2760. [all data]

Santiago, Gandour, et al., 1978
Santiago, C.; Gandour, R.W.; Houk, K.N.; Nutakul, W.; Cravey, W.E.; Thummel, R.P., Photoelectron and ultraviolet spectra of small-ring fused aromatic molecules as probes of aromatic ring distortions, J. Am. Chem. Soc., 1978, 100, 3730. [all data]