Triphenylene, 1,2,3,4,5,6,7,8,9,10,11,12-dodecahydro-

Gas phase ion energetics data

Data compiled as indicated in comments:
LLK - Sharon G. Lias, Rhoda D. Levin, and Sherif A. Kafafi
RDSH - Henry M. Rosenstock, Keith Draxl, Bruce W. Steiner, and John T. Herron

Ionization energy determinations

IE (eV) Method Reference Comment
7.70 ± 0.05PEHeilbronner, Kovac, et al., 1981LLK
8.60 ± 0.03EIMeier, Heiss, et al., 1968RDSH

References

Heilbronner, Kovac, et al., 1981
Heilbronner, E.; Kovac, B.; Nutakul, W.; Taggart, A.D.; Thummel, R.P., Trisannelated benzenes. Preparation, properties, and photoelectron spectra, J. Org. Chem., 1981, 46, 5279. [all data]

Meier, Heiss, et al., 1968
Meier, H.; Heiss, J.; Suhr, H.; Muller, E., Energetische Untersuchungen zum Mills-Nixon-Effekt. Ionisierungsenergien von Benzolmolekulen mit ankondensierten gesattigten Ringen, Tetrahedron, 1968, 24, 2307. [all data]