Pentayttrium monoxide

Gas phase ion energetics data

Data compiled as indicated in comments:
LL - Sharon G. Lias and Joel F. Liebman
B - John E. Bartmess

Electron affinity determinations

EA (eV) Method Reference Comment
1.05 ± 0.12LPESPramann, Nakamura, et al., 2001Vertical Detachment Energy: 1.19±0.04 eV; B

Ionization energy determinations

IE (eV) Method Reference Comment
4.25PIKnickelbein, 1995Vertical value; LL
4.85PIKnickelbein, 1995Vertical value; LL

References

Pramann, Nakamura, et al., 2001
Pramann, A.; Nakamura, Y.; Nakajima, A.; Kaya, K., Photoelectron spectroscopy of yttrium oxide cluster anions: Effects of oxygen and metal atom addition, J. Phys. Chem. A, 2001, 105, 32, 7534-7540, https://doi.org/10.1021/jp010749b . [all data]

Knickelbein, 1995
Knickelbein, M., Photoionization spectroscopy of yttrium clusters: Ionization potentials for Yn and YnO (n=2-31), J. Chem. Phys., 1995, 102, 1. [all data]