N,N-Didecylaniline

Gas phase ion energetics data

Data compiled by: Henry M. Rosenstock, Keith Draxl, Bruce W. Steiner, and John T. Herron

Ionization energy determinations

IE (eV) Method Reference
7.1CTSBriegleb and Czekalla, 1959

References

Briegleb and Czekalla, 1959
Briegleb, G.; Czekalla, J., Die Bestimmung von lonisierungsenergien aus den Spektren von Elektronenubergangskomplexen, Z.Elektrochem., 1959, 63, 6. [all data]