Erbium monofluoride

Gas phase ion energetics data

Data compiled as indicated in comments:
RDSH - Henry M. Rosenstock, Keith Draxl, Bruce W. Steiner, and John T. Herron

Ionization energy determinations

IE (eV) Method Reference Comment
6.3 ± 0.3EIZmbov and Margrave, 1966RDSH

References

Zmbov and Margrave, 1966
Zmbov, K.F.; Margrave, J.L., Mass spectrometric studies at high temperatures. XII.Stabilities of dysprosium, holmium, and erbium subfluorides, J. Phys. Chem., 1966, 70, 3379. [all data]