2-Fluorenyl-2-methyl-1,3-cyclopentandione

Phase change data

Data compiled by: William E. Acree, Jr., James S. Chickos

Enthalpy of sublimation

ΔsubH (kJ/mol) Temperature (K) Method Reference Comment
122.3 ± 1.6371.TNolke, Verevkin, et al., 1995Based on data from 353. - 388. K.

Enthalpy of fusion

ΔfusH (kJ/mol) Temperature (K) Method Reference
24.6395.2DSCNolke, Verevkin, et al., 1995

References

Nolke, Verevkin, et al., 1995
Nolke, M.; Verevkin, S.P.; Beckhaus, H.-D.; Rchardt, C., Thermische Stabilität und Bildungsenthalpie von β-Dicarbonylverbindungen. - Stabilisierung von α,α'-Diketoalkyl-Radikalen, Liebigs Ann., 1995, 41-51. [all data]