2-Diphenylmethyl-2-ethyl-1,3-cyclopentandione

Phase change data

Data compiled by: William E. Acree, Jr., James S. Chickos

Enthalpy of sublimation

ΔsubH (kJ/mol) Temperature (K) Method Reference Comment
122.8 ± 0.7360.TNolke, Verevkin, et al., 1995Based on data from 342. - 377. K.

Enthalpy of fusion

ΔfusH (kJ/mol) Temperature (K) Reference
28.2382.2Nolke, Verevkin, et al., 1995

References

Nolke, Verevkin, et al., 1995
Nolke, M.; Verevkin, S.P.; Beckhaus, H.-D.; Rchardt, C., Thermische Stabilität und Bildungsenthalpie von β-Dicarbonylverbindungen. - Stabilisierung von α,α'-Diketoalkyl-Radikalen, Liebigs Ann., 1995, 41-51. [all data]